fix 324 - fixed fusion.ml 017

1 job for armtranslation in 54 seconds (queued for 1 second)
Status Name Job ID Coverage
  Build
failed build #638

00:00:54

 
Name Stage Failure
failed
build Build There is an unknown failure, please try again
	export declaration : (|1|, |1|, {insns: sem_stmt_list, succ_a: stmts_option, succ_b: stmts_option, jzl:...}) -> S {insns: sem_stmt_list, succ_a: stmts_option, succ_b: stmts_option, jzm:...} <{jzn:...} => {jzo:...}>
unhandled exception: CompilationError
CMakeFiles/gdsl_x86_rreil.dir/build.make:96: recipe for target 'gdsl-x86-rreil.c' failed
make[2]: *** [gdsl-x86-rreil.c] Error 1
CMakeFiles/Makefile2:67: recipe for target 'CMakeFiles/gdsl_x86_rreil.dir/all' failed
make[1]: *** [CMakeFiles/gdsl_x86_rreil.dir/all] Error 2
Makefile:129: recipe for target 'all' failed
make: *** [all] Error 2
ERROR: Job failed: exit status 1