fix 308 - fixed fusion.ml 001

1 job for armtranslation in 44 seconds
Status Name Job ID Coverage
  Build
failed build #619

00:00:44

 
Name Stage Failure
failed
build Build There is an unknown failure, please try again
[/home/gitlab-runner/builds/ca62c1d8/0/zenzl/gdsl-toolkit/specifications/rreil/fusion/fusion.ml:124.14] Error: syntax error; try deleting "ID } :"
unhandled exception: CompilationError
CMakeFiles/gdsl_x86_rreil.dir/build.make:96: recipe for target 'gdsl-x86-rreil.c' failed
make[2]: *** [gdsl-x86-rreil.c] Error 1
CMakeFiles/Makefile2:67: recipe for target 'CMakeFiles/gdsl_x86_rreil.dir/all' failed
make[1]: *** [CMakeFiles/gdsl_x86_rreil.dir/all] Error 2
Makefile:129: recipe for target 'all' failed
make: *** [all] Error 2
ERROR: Job failed: exit status 1