fixed semantic translation for smlad - 005

1 job for armtranslation in 1 minute and 9 seconds (queued for 2 seconds)
Status Name Job ID Coverage
  Build
failed build #1145

00:01:09

 
Name Stage Failure
failed
build Build There is an unknown failure, please try again
	to function movsx               : (int, sem_var, int, sem_linear) -> S () <{stack: sem_stmt_list, cjm:...} => {stack: sem_stmt_list, cjm:...}>
unhandled exception: CompilationError
CMakeFiles/gdsl_arm7_rreil.dir/build.make:91: recipe for target 'gdsl-arm7-rreil.c' failed
make[2]: *** [gdsl-arm7-rreil.c] Error 1
CMakeFiles/Makefile2:104: recipe for target 'CMakeFiles/gdsl_arm7_rreil.dir/all' failed
make[1]: *** [CMakeFiles/gdsl_arm7_rreil.dir/all] Error 2
Makefile:129: recipe for target 'all' failed
make: *** [all] Error 2
ERROR: Job failed: exit status 1