added semantic translation for smlad

1 job for armtranslation in 1 minute and 23 seconds (queued for 3 seconds)
Status Name Job ID Coverage
  Build
failed build #1135

00:01:23

 
Name Stage Failure
failed
build Build There is an unknown failure, please try again
    resolveSymbols finished in: 0.026s (0.000s gc)
[/home/gitlab-runner/builds/ca62c1d8/0/zenzl/gdsl-toolkit/specifications/arm7/arm7-rreil-translator.ml:1452.33-38] Error: variable 'opnd1' is not defined unhandled exception: CompilationError
CMakeFiles/gdsl_arm7_rreil.dir/build.make:91: recipe for target 'gdsl-arm7-rreil.c' failed
make[2]: *** [gdsl-arm7-rreil.c] Error 1
CMakeFiles/Makefile2:104: recipe for target 'CMakeFiles/gdsl_arm7_rreil.dir/all' failed
make[1]: *** [CMakeFiles/gdsl_arm7_rreil.dir/all] Error 2
Makefile:129: recipe for target 'all' failed
make: *** [all] Error 2
ERROR: Job failed: exit status 1